我对rbenv很新,更不用说ruby并且在诊断以下安装失败时遇到一些困难:

rbenv install 2.0.0-p0
Downloading yaml-0.1.6.tar.gz...
-> http://dqw8nmjcqpjn7.cloudfront.net/5fe00cda18ca5daeb43762b80c38e06e
Installing yaml-0.1.6...
Installed yaml-0.1.6 to /Users/Haani/.rbenv/versions/2.0.0-p0

Downloading ruby-2.0.0-p0.tar.gz...
-> http://dqw8nmjcqpjn7.cloudfront.net/50d307c4dc9297ae59952527be4e755d
Installing ruby-2.0.0-p0...

BUILD FAILED

Inspect or clean up the working tree at /var/folders/50/wzjqg8d11sn7xnkrsmgr1gn80000gn/T/ruby-build.20140420110650.75863
Results logged to /var/folders/50/wzjqg8d11sn7xnkrsmgr1gn80000gn/T/ruby-build.20140420110650.75863.log

Last 10 log lines:
compiling ossl_x509cert.c
compiling ossl_x509crl.c
compiling ossl_x509ext.c
compiling ossl_x509name.c
compiling ossl_x509req.c
compiling ossl_x509revoked.c
compiling ossl_x509store.c
installing default openssl libraries
linking shared-object openssl.bundle
make: *** [build-ext] Error 2

在此处查看完整日志

===============>>#1 票数:8 已采纳

Homebrew软件包“readline”似乎有问题。

brew uninstall readline
brew install https://raw.githubusercontent.com/Homebrew/homebrew/0181c8a1633353affefabe257c170edbd6d7c008/Library/Formula/readline.rb
brew pin readline

然后重试安装ruby

rbenv install 2.0.0-p0

通过https://github.com/sstephenson/rbenv/issues/579#issuecomment-41122071找到答案

  ask by kaizenCoder translate from so

未解决问题?本站智能推荐:

4回复

尝试在OSX BUILD FAILED上使用rbenv安装ruby 2.1.2

因此,正如标题所暗示的那样,我正在尝试安装ruby 2.1.2,尽管我已经尝试安装其他版本,但我得到了同样的错误。 我正在运行OSX 10.9.2。 我试过了: 通过brew install gcc47安装新的gcc编译器 安装更新的OSX命令行工具 卸载rbenv并再
3回复

使用rbenv BUILD FAILED安装ruby-2.0.0-p0

所以我尝试在我运行在VirtualBox上的新ubuntu 12.04LTS上通过rbenv安装ruby。 我从rbenv https://github.com/sstephenson/rbenv和红宝石打造https://github.com/sstephenson/ruby-build
2回复

失败(使用ruby-build 20190828的OS X 10.14.6)通过rbenv安装Ruby

我正在尝试通过rbenv在macOS Mojave上安装ruby 2.6.4 rbenv install 2.6.4 但是每次我尝试它都会给我: 到目前为止尝试过的解决方案: 1) xcode-select --install 2)在xcode中open /Lib
1回复

尝试在Mac OS X 10.14.5上通过rbenv安装Ruby时出现BUILD FAILED

我正在尝试使用rbenv安装Ruby,但它最终会以BUILD FAILED消息结束。 我尝试重新安装Xcode,rbenv和homebrew但没有任何成功。 我在跑: rbenv install 2.6.3 我的目标是获得某种安装成功消息,但经过多次尝试后我一直在进行BU
1回复

如何通过rbenv / ruby​​-build在本地安装ruby?

我需要安装没有Internet访问权限的 ruby。 如ruby-build docs所建议,我可以通过指定环境变量RUBY_BUILD_MIRROR_URL来更改镜像URL。 我这样做了,尽管它查看了我本地的ruby仓库,但仍然尝试连接到在线仓库来安装yaml 。 我尝试将yaml
1回复

使用rbenv和ruby-build进行ruby安装失败

我想在VirtualBox的Mint 16 Cinnamon中安装ruby 2.1.2 。 我已经用ruby-build插件安装了rbenv并运行了rbenv install 2.1.2 ,但由于此错误而失败。 gcc --version输出: 我在rbenv instal
1回复

尝试安装ruby版本1.9.3-p327时,rbenv构建失败

更新: 我能够成功安装2.0.0-p451和1.9.3-p545,但是我仍然无法安装1.9.3-p327,当我尝试安装1.8.7-p375时,出现以下错误消息: 检出svn.ruby-lang.org/repos/ruby/branches/ruby_1_8_7 ...安装ruby-
2回复

rbenv:在UBUNTU 14.04(x86_64)上安装Ruby 2.2.3时建立失败

我正在尝试安装ruby 2.2.3,之前我已经安装了ruby 2.2.2, 尝试安装Ruby 2.2.3时出现问题,下面的构建失败: 我检查了日志,只是复制了一部分嫌疑人,因为另一个检查和编译过程很好: 我试图按照这个rbenv安装ruby BUILD FAILED
3回复

使用rbenv / ruby​​-build安装捆绑程序

我已经安装了rbenv并使用ruby-build下载了ruby,例如 rbenv global 1.9.3-p448 gem env # This show my customized ruby gem paths instead the system one, # so i
1回复

rbenv安装给我一个Build Failed

我有问题让ruby-build通过rbenv工作。 当我运行rbenv install 2.2.2(或任何其他版本)时,我得到以下输出: 完整的日志不会太长,但我会在这里发布它们,以防万一它们是相关的: 我在网上搜索并没有看到任何其他人在ruby-build或rbenv遇到此错