簡體   English   中英

python install zbar 錯誤:安裝腳本退出並出現錯誤:命令“gcc”失敗,退出狀態為 1

[英]python install zbar error: Setup script exited with error: command 'gcc' failed with exit status 1

環境:

 pyenv versions system 2.7.13 * 3.4.3 (set by /home/foo/.pyenv/version) 3.4.3/envs/venv343 venv343

easy_install zbar 同時遇到以下錯誤:

Searching for zbar
Reading https://pypi.python.org/simple/zbar/
Downloading https://files.pythonhosted.org/packages/e0/5c/bd2a96a9f2adacffceb4482cdd56831735ab5a67ea6a60c0a8757c17b62e/zbar-0.10.tar.gz#sha256=5d0dad77dbca8822a4689c546f598f28030321efb14fa36ac
5e409d181a0d9dd
Best match: zbar 0.10
Processing zbar-0.10.tar.gz
Writing /tmp/easy_install-oaUXl5/zbar-0.10/setup.cfg
Running zbar-0.10/setup.py -q bdist_egg --dist-dir /tmp/easy_install-oaUXl5/zbar-0.10/egg-dist-tmp-5Jv6UI
In file included from zbarmodule.c:24:0:
zbarmodule.h:26:18: fatal error: zbar.h: No such file or directory
 #include <zbar.h>
                  ^
compilation terminated.
error: Setup script exited with error: command 'gcc' failed with exit status 1

正如在 stackoverflow 上提到的這個問題,以下程序已經嘗試過但不起作用:

sudo apt-get install build-essential
sudo apt-get install bzip2
sudo apt-get install bzip2-dev
sudo apt-get install gcc
sudo apt-get install gcc-4.4
sudo apt-get install libbz2
sudo apt-get install libbz2-dev
sudo apt-get install libevent
sudo apt-get install libevent1-dev
sudo apt-get install libevent-dev
sudo apt-get install libgcc
sudo apt-get install libgcc1
sudo apt-get install libgcc1-4.7-dev
sudo apt-get install libgcc1-dev
sudo apt-get install libgcc-4.8-dev
sudo apt-get install libpython3.4-dev
sudo apt-get install libpython3.4-stdlib
sudo apt-get install libpython3-dev
sudo apt-get install libpython3-stdlib
sudo apt-get install libssl-dev
sudo apt-get install openssl
sudo apt-get install python3.4-dev
sudo apt-get install python3.4-devel
sudo apt-get install python3-dev
sudo apt-get install python3-devl
sudo apt-get install python3-gcc
sudo apt-get install python-dev
sudo apt-get install python-devel
sudo apt-get install python-setuptools

雖然按照一些朋友的建議安裝 libzbar-dev,但錯誤信息似乎有所不同,但仍然無法正常工作

Searching for zbar
Reading https://pypi.python.org/simple/zbar/
Best match: zbar 0.10
Downloading https://files.pythonhosted.org/packages/e0/5c/bd2a96a9f2adacffceb4482cdd56831735ab5a67ea6a60c0a8757c17b62e/zbar-0.10.tar.gz#sha256=5d0dad77dbca8822a4689c546f598f28030321efb14fa36ac
5e409d181a0d9dd
Processing zbar-0.10.tar.gz
Writing /tmp/easy_install-cw6n9lyu/zbar-0.10/setup.cfg
Running zbar-0.10/setup.py -q bdist_egg --dist-dir /tmp/easy_install-cw6n9lyu/zbar-0.10/egg-dist-tmp-vbl6ojsc
In file included from zbarmodule.c:24:0:
zbarmodule.h:42:5: error: unknown type name ‘PyIntObject’
     PyIntObject val;            /* integer value is super type */
     ^
zbarmodule.c: In function ‘initzbar’:
zbarmodule.c:112:9: warning: ‘return’ with no value, in function returning non-void [-Wreturn-type]
         return;
         ^
zbarmodule.c:115:34: error: ‘PyInt_Type’ undeclared (first use in this function)
     zbarEnumItem_Type.tp_base = &PyInt_Type;
                                  ^
zbarmodule.c:115:34: note: each undeclared identifier is reported only once for each function it appears in
zbarmodule.c:129:9: warning: ‘return’ with no value, in function returning non-void [-Wreturn-type]
         return;
         ^
zbarmodule.c:137:13: warning: ‘return’ with no value, in function returning non-void [-Wreturn-type]
             return;
             ^
zbarmodule.c:146:5: warning: implicit declaration of function ‘Py_InitModule’ [-Wimplicit-function-declaration]
     PyObject *mod = Py_InitModule("zbar", zbar_functions);
     ^
zbarmodule.c:146:21: warning: initialization makes pointer from integer without a cast [enabled by default]
     PyObject *mod = Py_InitModule("zbar", zbar_functions);
                     ^
zbarmodule.c:148:9: warning: ‘return’ with no value, in function returning non-void [-Wreturn-type]
         return;
         ^
error: Setup script exited with error: command 'gcc' failed with exit status 1

我怎么能解決這個問題? 謝謝你的所有答案

在 ubuntu 和 Mint 上

sudo apt-get install python-zbar libzbar-dev python-qrtools

pip install libzbar-cffi==0.2.1

zbar_version 函數需要一個補丁參數。 嘗試使用以下命令構建您自己的模塊: https : //github.com/rxwen/zbar.git

pip 安裝 git+https://github.com/rxwen/zbar.git

來自另一篇文章似乎無關緊要我想出了解決方案

導入錯誤:Linux Mint 上沒有名為 zbar 的模塊

然而,只有 zbar-tools 不足以獲得好的結果,我輸入了

sudo apt-get install zbar-

然后按TAB然后找到zbar-dbg,只是為了嘗試,它確實有效。

sudo apt-get install zbar-tools zbar-dbg

確實由 zbar 問題引起的 gcc 錯誤確實讓我感到震驚。 也許對類似問題有一些啟發,所以我把它放在這里。

暫無
暫無

聲明:本站的技術帖子網頁,遵循CC BY-SA 4.0協議,如果您需要轉載,請注明本站網址或者原文地址。任何問題請咨詢:yoyou2525@163.com.

 
粵ICP備18138465號  © 2020-2024 STACKOOM.COM